Reaction Details
TargetNeuronal acetylcholine receptor subunit alpha-7
LigandBDBM50170593
Substrate/Competitorn/a
Meas. Tech.ChEMBL_306101 (CHEMBL830876)
IC50 200±n/a nM
Citation Jensen, AAFrølund, BLiljefors, TKrogsgaard-Larsen, P Neuronal nicotinic acetylcholine receptors: structural revelations, target identifications, and therapeutic inspirations. J Med Chem48:4705-45 (2005) 
 
Neuronal acetylcholine receptor subunit alpha-7
Name:Neuronal acetylcholine receptor subunit alpha-7
Type:n/a
Mol. Mass.:56448.33
Organism:Homo sapiens (Human)
Description: CHRNA7 (NACHRA7)
Residue:502
BDBM50170593
NameBDBM50170593
Synonyms:(3S)-3-[(2S)-2-[(2R)-2-[(2R)-2-(2-aminoacetamido)-3-sulfanylpropanamido]-3-sulfanylpropanamido]-3-hydroxypropanamido]-4-[(2S)-2-{[(1S)-1-{[(1R)-1-{[(1S)-1-{[(1S)-1-{[(1S)-1-carbamoyl-4-[(diaminomethylidene)amino]butyl]carbamoyl}-2-(1H-indol-3-yl)ethyl]carbamoyl}ethyl]carbamoyl}-2-sulfanylethyl]carbamoyl}-4-[(diaminomethylidene)amino]butyl]carbamoyl}pyrrolidin-1-yl]-4-oxobutanoic acid | CHEMBL386114
TypeSmall organic molecule
Emp. Form.C49H77N19O14S3
Mol. Mass.1252.45
SMILESC[C@H](NC(=O)[C@H](CS)NC(=O)[C@H](CCCNC(N)=N)NC(=O)[C@@H]1CCCN1C(=O)[C@H](CC(O)=O)NC(=O)[C@H](CO)NC(=O)[C@H](CS)NC(=O)[C@H](CS)NC(=O)CN)C(=O)N[C@@H](Cc1c[nH]c2ccccc12)C(=O)N[C@@H](CCCNC(N)=N)C(N)=O