Reaction Details
TargetNeuronal acetylcholine receptor subunit alpha-7
LigandBDBM50061562
Substrate/Competitorn/a
Meas. Tech.ChEMBL_305504 (CHEMBL831106)
IC50 98000±n/a nM
Citation Jensen, AAFrølund, BLiljefors, TKrogsgaard-Larsen, P Neuronal nicotinic acetylcholine receptors: structural revelations, target identifications, and therapeutic inspirations. J Med Chem48:4705-45 (2005) 
 
Neuronal acetylcholine receptor subunit alpha-7
Name:Neuronal acetylcholine receptor subunit alpha-7
Type:n/a
Mol. Mass.:56448.33
Organism:Homo sapiens (Human)
Description: CHRNA7 (NACHRA7)
Residue:502
BDBM50061562
NameBDBM50061562
Synonyms:(12R,13aR)-12-Methoxy-1,4,5,6,9,11,12,13-octahydro-8H-pyrano[4',3':3,4]pyrido[2,1-i]indol-2-one Dihydro-Beta-erythroidine
TypeSmall organic molecule
Emp. Form.C16H21NO3
Mol. Mass.275.3428
SMILESCO[C@@H]1CC=C2CCN3CCC4=C(CC(=O)OC4)[C@@]23C1