Reaction Details
TargetNeuronal acetylcholine receptor subunit alpha-4/beta-2
LigandBDBM50170600
Substrate/Competitorn/a
Meas. Tech.ChEMBL_305760 (CHEMBL827098)
IC50 9.6±n/a nM
Citation Jensen, AAFrølund, BLiljefors, TKrogsgaard-Larsen, P Neuronal nicotinic acetylcholine receptors: structural revelations, target identifications, and therapeutic inspirations. J Med Chem48:4705-45 (2005) 
 
Neuronal acetylcholine receptor subunit alpha-4/beta-2
Name:Neuronal acetylcholine receptor subunit alpha-4/beta-2
Type:Protein
Mol. Mass.:n/a
Description:n/a
Components:This complex has 2 components.
Component 1
Name:Neuronal acetylcholine receptor subunit alpha-4
Synonyms:ACHA4_HUMAN CHRNA4 protein Neuronal acetylcholine receptor protein alpha-4 subunit Nicotinic acetylcholine receptor alpha4/beta2/alpha5
Type:n/a
Mol. Mass.:69963.49
Organism:Homo sapiens (Human)
Description:NACHRA4
Residue:627
Component 2
Name:Neuronal acetylcholine receptor subunit beta-2
Synonyms:ACHB2_HUMAN Neuronal acetylcholine receptor protein beta-2 subunit | Nicotinic acetylcholine receptor alpha3/beta2/alpha5
Type:Protein
Mol. Mass.:57020.50
Organism:Homo sapiens (Human)
Description:P17787
Residue:502
BDBM50170600
NameBDBM50170600
Synonyms:(3S)-3-{[(2S)-1-[(2S)-2-[(2S)-2-[(2S)-2-[(2S)-2-[(2R)-2-{[(2S)-1-{[(2S)-1-[(2S)-2-[(2S)-2-[(2R)-2-[(2R)-2-(2-aminoacetamido)-3-sulfanylpropanamido]-3-sulfanylpropanamido]-3-hydroxypropanamido]-4-methylpentanoyl]pyrrolidin-2-yl]carbonyl}pyrrolidin-2-yl]formamido}-3-sulfanylpropanamido]propanamido]propanamido]-3-carbamoylpropanamido]-3-carbamoylpropanoyl]pyrrolidin-2-yl]formamido}-3-{[(1S)-1-{[(1R)-1-carbamoyl-2-sulfanylethyl]carbamoyl}-2-(4-hydroxyphenyl)ethyl]carbamoyl}propanoic acid | CHEMBL409988
TypeSmall organic molecule
Emp. Form.C65H99N19O22S4
Mol. Mass.1626.856
SMILESCC(C)C[C@H](NC(=O)[C@H](CO)NC(=O)[C@H](CS)NC(=O)[C@H](CS)NC(=O)CN)C(=O)N1CCC[C@H]1C(=O)N1CCC[C@H]1C(=O)N[C@@H](CS)C(=O)N[C@@H](C)C(=O)N[C@@H](C)C(=O)N[C@@H](CC(N)=O)C(=O)N[C@@H](CC(N)=O)C(=O)N1CCC[C@H]1C(=O)N[C@@H](CC(O)=O)C(=O)N[C@@H](Cc1ccc(O)cc1)C(=O)N[C@@H](CS)C(N)=O