Reaction Details
TargetC-8 sterol isomerase ERG2
LigandBDBM50003027
Substrate/Competitorn/a
Meas. Tech.ChEMBL_303390 (CHEMBL839961)
Ki 0.40±n/a nM
Citation Laggner, CSchieferer, CFiechtner, BPoles, GHoffmann, RDGlossmann, HLanger, TMoebius, FF Discovery of high-affinity ligands of sigma1 receptor, ERG2, and emopamil binding protein by pharmacophore modeling and virtual screening. J Med Chem48:4754-64 (2005) 
 
C-8 sterol isomerase ERG2
Name:C-8 sterol isomerase ERG2
Type:PROTEIN
Mol. Mass.:24892.29
Organism:Saccharomyces cerevisiae
Description:ChEMBL_303390
Residue:222
BDBM50003027
NameBDBM50003027
Synonyms:(4aS,5S,6S,8aS)-5,8a-Dimethyl-2-(1,5,9-trimethyl-decyl)-decahydro-isoquinolin-6-ol CHEMBL17470
TypeSmall organic molecule
Emp. Form.C24H47NO
Mol. Mass.365.6361
SMILESCC(C)CCCC(C)CCCC(C)N1CC[C@H]2[C@H](C)[C@@H](O)CC[C@]2(C)C1