Reaction Details
TargetSigma non-opioid intracellular receptor 1
LigandBDBM50080017
Substrate/Competitorn/a
Meas. Tech.ChEMBL_303441 (CHEMBL839610)
Ki 2±n/a nM
Citation Laggner, CSchieferer, CFiechtner, BPoles, GHoffmann, RDGlossmann, HLanger, TMoebius, FF Discovery of high-affinity ligands of sigma1 receptor, ERG2, and emopamil binding protein by pharmacophore modeling and virtual screening. J Med Chem48:4754-64 (2005) 
 
Sigma non-opioid intracellular receptor 1
Name:Sigma non-opioid intracellular receptor 1
Type:Enzyme Catalytic Domain
Mol. Mass.:25124.85
Organism:Homo sapiens (Human)
Description:Q99720
Residue:223
BDBM50080017
NameBDBM50080017
Synonyms:(+/-)-[2-(4-benzylpiperidino)-1-(4-hydroxyphenyl)-1-propanol] -(2-(4-benzylpiperidin-1-yl)-1-hydroxypropyl)phenol 4-(2-(4-benzylpiperidin-1-yl)-1-hydroxypropyl)phenol 4-[2-(4-Benzyl-piperidin-1-yl)-1-hydroxy-propyl]-phenol ifenprodil
TypeSmall organic molecule
Emp. Form.C21H27NO2
Mol. Mass.325.4446
SMILESC[C@H]([C@@H](O)c1ccc(O)cc1)N1CCC(Cc2ccccc2)CC1