Reaction Details
Target3-beta-hydroxysteroid-Delta(8),Delta(7)-isomerase
LigandBDBM55354
Substrate/Competitorn/a
Meas. Tech.ChEMBL_303691 (CHEMBL829736)
Ki 1±n/a nM
Citation Laggner, CSchieferer, CFiechtner, BPoles, GHoffmann, RDGlossmann, HLanger, TMoebius, FF Discovery of high-affinity ligands of sigma1 receptor, ERG2, and emopamil binding protein by pharmacophore modeling and virtual screening. J Med Chem48:4754-64 (2005) 
 
3-beta-hydroxysteroid-Delta(8),Delta(7)-isomerase
Name:3-beta-hydroxysteroid-Delta(8),Delta(7)-isomerase
Type:PROTEIN
Mol. Mass.:26358.51
Organism:Homo sapiens (Human)
Description:ChEMBL_873432
Residue:230
BDBM55354
NameBDBM55354
Synonyms:CLOMIPHENE MLS000069760 cid_1548953 | cid_6420009
TypeSmall organic molecule
Emp. Form.C26H28ClNO
Mol. Mass.405.96
SMILESCCN(CC)CCOc1ccc(cc1)C(=C(\Cl)c1ccccc1)\c1ccccc1