Reaction Details
TargetC-8 sterol isomerase ERG2
LigandBDBM50080017
Substrate/Competitorn/a
Meas. Tech.ChEMBL_303390 (CHEMBL839961)
Ki 1±n/a nM
Citation Laggner, CSchieferer, CFiechtner, BPoles, GHoffmann, RDGlossmann, HLanger, TMoebius, FF Discovery of high-affinity ligands of sigma1 receptor, ERG2, and emopamil binding protein by pharmacophore modeling and virtual screening. J Med Chem48:4754-64 (2005) 
 
C-8 sterol isomerase ERG2
Name:C-8 sterol isomerase ERG2
Type:PROTEIN
Mol. Mass.:24892.29
Organism:Saccharomyces cerevisiae
Description:ChEMBL_303390
Residue:222
BDBM50080017
NameBDBM50080017
Synonyms:(+/-)-[2-(4-benzylpiperidino)-1-(4-hydroxyphenyl)-1-propanol] -(2-(4-benzylpiperidin-1-yl)-1-hydroxypropyl)phenol 4-(2-(4-benzylpiperidin-1-yl)-1-hydroxypropyl)phenol 4-[2-(4-Benzyl-piperidin-1-yl)-1-hydroxy-propyl]-phenol ifenprodil
TypeSmall organic molecule
Emp. Form.C21H27NO2
Mol. Mass.325.4446
SMILESC[C@H]([C@@H](O)c1ccc(O)cc1)N1CCC(Cc2ccccc2)CC1