Reaction Details
Target3-beta-hydroxysteroid-Delta(8),Delta(7)-isomerase
LigandBDBM50170657
Substrate/Competitorn/a
Meas. Tech.ChEMBL_303691 (CHEMBL829736)
Ki 1±n/a nM
Citation Laggner, CSchieferer, CFiechtner, BPoles, GHoffmann, RDGlossmann, HLanger, TMoebius, FF Discovery of high-affinity ligands of sigma1 receptor, ERG2, and emopamil binding protein by pharmacophore modeling and virtual screening. J Med Chem48:4754-64 (2005) 
 
3-beta-hydroxysteroid-Delta(8),Delta(7)-isomerase
Name:3-beta-hydroxysteroid-Delta(8),Delta(7)-isomerase
Type:PROTEIN
Mol. Mass.:26358.51
Organism:Homo sapiens (Human)
Description:ChEMBL_873432
Residue:230
BDBM50170657
NameBDBM50170657
Synonyms:1''-butyl-3,4-dihydro-2H-spiro[naphthalene-1,4''-piperidine] CHEMBL1788381 | CHEMBL62540
TypeSmall organic molecule
Emp. Form.C18H27N
Mol. Mass.257.4137
SMILESCCCCN1CCC2(CCCc3ccccc23)CC1