Reaction Details
Target3-beta-hydroxysteroid-Delta(8),Delta(7)-isomerase
LigandBDBM71545
Substrate/Competitorn/a
Meas. Tech.ChEMBL_303691 (CHEMBL829736)
Ki 2±n/a nM
Citation Laggner, CSchieferer, CFiechtner, BPoles, GHoffmann, RDGlossmann, HLanger, TMoebius, FF Discovery of high-affinity ligands of sigma1 receptor, ERG2, and emopamil binding protein by pharmacophore modeling and virtual screening. J Med Chem48:4754-64 (2005) 
 
3-beta-hydroxysteroid-Delta(8),Delta(7)-isomerase
Name:3-beta-hydroxysteroid-Delta(8),Delta(7)-isomerase
Type:PROTEIN
Mol. Mass.:26358.51
Organism:Homo sapiens (Human)
Description:ChEMBL_873432
Residue:230
BDBM71545
NameBDBM71545
Synonyms:2-[4-[(Z)-2-chloranyl-1,2-diphenyl-ethenyl]phenoxy]-N,N-diethyl-ethanamine;2-oxidanylpropane-1,2,3-tricarboxylic acid 2-[4-[(Z)-2-chloro-1,2-diphenylethenyl]phenoxy]-N,N-diethylethanamine;2-hydroxypropane-1,2,3-tricarboxylic acid Clomiphene citrate salt MLS001332630 cid_3033832
TypeSmall organic molecule
Emp. Form.C26H28ClNO
Mol. Mass.405.96
SMILESCCN(CC)CCOc1ccc(cc1)C(=C(/Cl)c1ccccc1)\c1ccccc1