Reaction Details
TargetSigma non-opioid intracellular receptor 1
LigandBDBM50170654
Substrate/Competitorn/a
Meas. Tech.ChEMBL_303441 (CHEMBL839610)
Ki 0.01±n/a nM
Citation Laggner, CSchieferer, CFiechtner, BPoles, GHoffmann, RDGlossmann, HLanger, TMoebius, FF Discovery of high-affinity ligands of sigma1 receptor, ERG2, and emopamil binding protein by pharmacophore modeling and virtual screening. J Med Chem48:4754-64 (2005) 
 
Sigma non-opioid intracellular receptor 1
Name:Sigma non-opioid intracellular receptor 1
Type:Enzyme Catalytic Domain
Mol. Mass.:25124.85
Organism:Homo sapiens (Human)
Description:Q99720
Residue:223
BDBM50170654
NameBDBM50170654
Synonyms:(+-)-cis-4-(3-(4-tert-butylphenyl)-2-methylpropyl)-2,6-dimethylmorpholine CHEMBL372700 cis-4-(3-(4-(1,1-dimethylethyl)phenyl)-2-methylpropyl)-2,6-dimethylmorpholine cis-fenpropimorph fenpropimorph cis-form | fenpropimorphe
TypeSmall organic molecule
Emp. Form.C20H33NO
Mol. Mass.303.4821
SMILESCC(CN1C[C@H](C)O[C@H](C)C1)Cc1ccc(cc1)C(C)(C)C