Reaction Details
TargetC-8 sterol isomerase ERG2
LigandBDBM55354
Substrate/Competitorn/a
Meas. Tech.ChEMBL_303390 (CHEMBL839961)
Ki 160±n/a nM
Citation Laggner, CSchieferer, CFiechtner, BPoles, GHoffmann, RDGlossmann, HLanger, TMoebius, FF Discovery of high-affinity ligands of sigma1 receptor, ERG2, and emopamil binding protein by pharmacophore modeling and virtual screening. J Med Chem48:4754-64 (2005) 
 
C-8 sterol isomerase ERG2
Name:C-8 sterol isomerase ERG2
Type:PROTEIN
Mol. Mass.:24892.29
Organism:Saccharomyces cerevisiae
Description:ChEMBL_303390
Residue:222
BDBM55354
NameBDBM55354
Synonyms:CLOMIPHENE MLS000069760 cid_1548953 | cid_6420009
TypeSmall organic molecule
Emp. Form.C26H28ClNO
Mol. Mass.405.96
SMILESCCN(CC)CCOc1ccc(cc1)C(=C(\Cl)c1ccccc1)\c1ccccc1