Reaction Details
TargetFatty-acid amide hydrolase 1
LigandBDBM50132713
Substrate/Competitorn/a
Meas. Tech.ChEMBL_306336 (CHEMBL828156)
IC50 3±n/a nM
Citation Lambert, DMFowler, CJ The endocannabinoid system: drug targets, lead compounds, and potential therapeutic applications. J Med Chem48:5059-87 (2005) 
 
Fatty-acid amide hydrolase 1
Name:Fatty-acid amide hydrolase 1
Type:Protein
Mol. Mass.:63071.19
Organism:Homo sapiens (Human)
Description:O00519
Residue:579
BDBM50132713
NameBDBM50132713
Synonyms:Arachidonic acid derivative Methyl arachidonoyl fluorophophonate methyl (5Z,8Z,11Z,14Z)-icosa-5,8,11,14-tetraenylphosphonofluoridate methyl(5Z,8Z,11Z,14Z)-icosa-5,8,11,14-tetraenylphosphonofluoridate | methylarachidonyl fluorophosphonate
TypeSmall organic molecule
Emp. Form.C21H36FO2P
Mol. Mass.370.4815
SMILESCCCCC\C=C/C\C=C/C\C=C/C\C=C/CCCCP(F)(=O)OC