Reaction Details
TargetFatty-acid amide hydrolase 1
LigandBDBM50171289
Substrate/Competitorn/a
Meas. Tech.ChEMBL_305965 (CHEMBL832951)
IC50 13000±n/a nM
Citation Lambert, DMFowler, CJ The endocannabinoid system: drug targets, lead compounds, and potential therapeutic applications. J Med Chem48:5059-87 (2005) 
 
Fatty-acid amide hydrolase 1
Name:Fatty-acid amide hydrolase 1
Type:Protein
Mol. Mass.:63071.19
Organism:Homo sapiens (Human)
Description:O00519
Residue:579
BDBM50171289
NameBDBM50171289
Synonyms:Benzenemethanesulfonyl fluoride PMSF alpha-toluenesulfonyl fluoride phenylmethylsulfonyl fluoride
TypeSmall organic molecule
Emp. Form.C7H7FO2S
Mol. Mass.174.193
SMILESFS(=O)(=O)Cc1ccccc1