Reaction Details
TargetFatty-acid amide hydrolase 1
LigandBDBM50171292
Substrate/Competitorn/a
Meas. Tech.ChEBML_306356
IC50 13±n/a nM
Citation Lambert, DMFowler, CJ The endocannabinoid system: drug targets, lead compounds, and potential therapeutic applications. J Med Chem48:5059-87 (2005) 
 
Fatty-acid amide hydrolase 1
Name:Fatty-acid amide hydrolase 1
Type:Protein
Mol. Mass.:63071.19
Organism:Homo sapiens (Human)
Description:O00519
Residue:579
BDBM50171292
NameBDBM50171292
Synonyms:CHEMBL32827 | Hexadecanoic acid isopropylamide
TypeSmall organic molecule
Emp. Form.C19H39NO
Mol. Mass.297.5191
(=O)NC(C)C