Reaction Details
TargetFatty-acid amide hydrolase 1
LigandBDBM50132715
Substrate/Competitorn/a
Meas. Tech.ChEMBL_305965 (CHEMBL832951)
IC50 3±n/a nM
Citation Lambert, DMFowler, CJ The endocannabinoid system: drug targets, lead compounds, and potential therapeutic applications. J Med Chem48:5059-87 (2005) 
 
Fatty-acid amide hydrolase 1
Name:Fatty-acid amide hydrolase 1
Type:Protein
Mol. Mass.:63071.19
Organism:Homo sapiens (Human)
Description:O00519
Residue:579
BDBM50132715
NameBDBM50132715
Synonyms:CHEMBL97038 dodecane-1-sulfonyl fluoride
TypeSmall organic molecule
Emp. Form.C12H25FO2S
Mol. Mass.252.389
SMILESCCCCCCCCCCCCS(F)(=O)=O