Reaction Details
TargetThymidylate synthase
LigandBDBM50028408
Substrate/Competitorn/a
Meas. Tech.ChEMBL_305777 (CHEMBL827966)
pH7.4±n/a
IC50 180±n/a nM
Commentsextracted
Citation Gangjee, AZeng, YMcGuire, JJKisliuk, RL Synthesis of classical, four-carbon bridged 5-substituted furo[2,3-d]pyrimidine and 6-substituted pyrrolo[2,3-d]pyrimidine analogues as antifolates. J Med Chem48:5329-36 (2005) 
 
Thymidylate synthase
Name:Thymidylate synthase
Type:Enzyme
Mol. Mass.:35718.07
Organism:Homo sapiens (Human)
Description:n/a
Residue:313
BDBM50028408
NameBDBM50028408
Synonyms:(R)-2-{4-[(2-Amino-4-oxo-1,4-dihydro-quinazolin-6-ylmethyl)-prop-2-ynyl-amino]-benzoylamino}-pentanedioic acid 2-{4-[(2-Amino-4-hydroxy-quinazolin-6-ylmethyl)-prop-2-ynyl-amino]-benzoylamino}-pentanedioic acid | CHEMBL265510
TypeSmall organic molecule
Emp. Form.C24H23N5O6
Mol. Mass.477.4693
SMILESNc1nc2ccc(CN(CC#C)c3ccc(cc3)C(=O)N[C@H](CCC(O)=O)C(O)=O)cc2c(=O)[nH]1