Reaction Details
TargetDihydrofolate reductase
LigandBDBM18796
Substrate/Competitorn/a
Meas. Tech.ChEMBL_305811 (CHEMBL829464)
pH7.4±n/a
IC50 2300±n/a nM
Commentsextracted
Citation Gangjee, AZeng, YMcGuire, JJKisliuk, RL Synthesis of classical, four-carbon bridged 5-substituted furo[2,3-d]pyrimidine and 6-substituted pyrrolo[2,3-d]pyrimidine analogues as antifolates. J Med Chem48:5329-36 (2005) 
 
Dihydrofolate reductase
Name:Dihydrofolate reductase
Type:Enzyme
Mol. Mass.:21453.99
Organism:Homo sapiens (Human)
Description:Recombinant human DHFR.
Residue:187
BDBM18796
NameBDBM18796
Synonyms:(2S)-2-{[4-(2-{2-amino-4-oxo-1H,4H,7H-pyrrolo[2,3-d]pyrimidin-5-yl}ethyl)phenyl]formamido}pentanedioic acid Pemetrexed
TypeSmall organic molecule
Emp. Form.C20H21N5O6
Mol. Mass.427.4106
SMILESNc1nc2[nH]cc(CCc3ccc(cc3)C(=O)N[C@@H](CCC(O)=O)C(O)=O)c2c(=O)[nH]1