Reaction Details
Target5-hydroxytryptamine receptor 6
LigandBDBM50159182
Substrate/Competitorn/a
Meas. Tech.ChEMBL_303674 (CHEMBL830434)
Ki 3±n/a nM
Citation Cole, DCLennox, WJLombardi, SEllingboe, JWBernotas, RCTawa, GJMazandarani, HSmith, DLZhang, GCoupet, JSchechter, LE Discovery of 5-arylsulfonamido-3-(pyrrolidin-2-ylmethyl)-1H-indole derivatives as potent, selective 5-HT6 receptor agonists and antagonists. J Med Chem48:353-6 (2005) 
 
5-hydroxytryptamine receptor 6
Name:5-hydroxytryptamine receptor 6
Type:G Protein-Coupled Receptor (GPCR)
Mol. Mass.:46968.43
Organism:Homo sapiens (Human)
Description:P50406
Residue:440
BDBM50159182
NameBDBM50159182
Synonyms:4-Isopropyl-N-[3-((R)-1-methyl-pyrrolidin-2-ylmethyl)-1H-indol-5-yl]-benzenesulfonamide | 4-Isopropyl-N-[3-((S)-1-methyl-pyrrolidin-2-ylmethyl)-1H-indol-5-yl]-benzenesulfonamide
TypeSmall organic molecule
Emp. Form.C23H29N3O2S
Mol. Mass.411.56
SMILESCC(C)c1ccc(cc1)S(=O)(=O)Nc1ccc2[nH]cc(CC3CCCN3C)c2c1