Reaction Details
Target5-hydroxytryptamine receptor 6
LigandBDBM50159194
Substrate/Competitorn/a
Meas. Tech.ChEMBL_303674 (CHEMBL830434)
Ki 1±n/a nM
Citation Cole, DCLennox, WJLombardi, SEllingboe, JWBernotas, RCTawa, GJMazandarani, HSmith, DLZhang, GCoupet, JSchechter, LE Discovery of 5-arylsulfonamido-3-(pyrrolidin-2-ylmethyl)-1H-indole derivatives as potent, selective 5-HT6 receptor agonists and antagonists. J Med Chem48:353-6 (2005) 
 
5-hydroxytryptamine receptor 6
Name:5-hydroxytryptamine receptor 6
Type:G Protein-Coupled Receptor (GPCR)
Mol. Mass.:46968.43
Organism:Homo sapiens (Human)
Description:P50406
Residue:440
BDBM50159194
NameBDBM50159194
Synonyms:4-Fluoro-N-[3-((R)-1-methyl-pyrrolidin-2-ylmethyl)-1H-indol-5-yl]-benzenesulfonamide
TypeSmall organic molecule
Emp. Form.C20H22FN3O2S
Mol. Mass.387.471
SMILESCN1CCCC1Cc1c[nH]c2ccc(NS(=O)(=O)c3ccc(F)cc3)cc12