Reaction Details
TargetCytochrome P450 2A6
LigandBDBM50159250
Substrate/Competitorn/a
Meas. Tech.ChEMBL_305266 (CHEMBL832816)
IC50 140000±n/a nM
Citation Rahnasto, MRaunio, HPoso, AWittekindt, CJuvonen, RO Quantitative structure-activity relationship analysis of inhibitors of the nicotine metabolizing CYP2A6 enzyme. J Med Chem48:440-9 (2005) 
 
Cytochrome P450 2A6
Name:Cytochrome P450 2A6
Type:Protein
Mol. Mass.:56514.34
Organism:Homo sapiens (Human)
Description:P11509
Residue:494
BDBM50159250
NameBDBM50159250
Synonyms:2-Naphthol CHEMBL14126 beta-hydroxynaphthalene | naphthalen-2-ol
TypeSmall organic molecule
Emp. Form.C10H8O
Mol. Mass.144.1699
SMILESOc1ccc2ccccc2c1