Reaction Details
TargetCytochrome P450 2A5
LigandBDBM50159250
Substrate/Competitorn/a
Meas. Tech.ChEMBL_305268 (CHEMBL832818)
IC50 78000±n/a nM
Citation Rahnasto, MRaunio, HPoso, AWittekindt, CJuvonen, RO Quantitative structure-activity relationship analysis of inhibitors of the nicotine metabolizing CYP2A6 enzyme. J Med Chem48:440-9 (2005) 
 
Cytochrome P450 2A5
Name:Cytochrome P450 2A5
Type:PROTEIN
Mol. Mass.:56752.73
Organism:Mus musculus
Description:ChEMBL_572014
Residue:494
BDBM50159250
NameBDBM50159250
Synonyms:2-Naphthol CHEMBL14126 beta-hydroxynaphthalene | naphthalen-2-ol
TypeSmall organic molecule
Emp. Form.C10H8O
Mol. Mass.144.1699
SMILESOc1ccc2ccccc2c1