Reaction Details
TargetCytochrome P450 2A5
LigandBDBM50159257
Substrate/Competitorn/a
Meas. Tech.ChEMBL_305268 (CHEMBL832818)
IC50 1700±n/a nM
Citation Rahnasto, MRaunio, HPoso, AWittekindt, CJuvonen, RO Quantitative structure-activity relationship analysis of inhibitors of the nicotine metabolizing CYP2A6 enzyme. J Med Chem48:440-9 (2005) 
 
Cytochrome P450 2A5
Name:Cytochrome P450 2A5
Type:PROTEIN
Mol. Mass.:56752.73
Organism:Mus musculus
Description:ChEMBL_572014
Residue:494
BDBM50159257
NameBDBM50159257
Synonyms:2,6-DMN CHEMBL194983
TypeSmall organic molecule
Emp. Form.C12H12
Mol. Mass.156.2237
SMILESCc1ccc2cc(C)ccc2c1