Reaction Details
TargetCytochrome P450 2A5
LigandBDBM50159263
Substrate/Competitorn/a
Meas. Tech.ChEMBL_305268 (CHEMBL832818)
IC50 1000±n/a nM
Citation Rahnasto, MRaunio, HPoso, AWittekindt, CJuvonen, RO Quantitative structure-activity relationship analysis of inhibitors of the nicotine metabolizing CYP2A6 enzyme. J Med Chem48:440-9 (2005) 
 
Cytochrome P450 2A5
Name:Cytochrome P450 2A5
Type:PROTEIN
Mol. Mass.:56752.73
Organism:Mus musculus
Description:ChEMBL_572014
Residue:494
BDBM50159263
NameBDBM50159263
Synonyms:1,4-dichlorobenzene PARA Paradichlorbenzol p-chlorophenyl chloride | paradichlorobenzene
TypeSmall organic molecule
Emp. Form.C6H4Cl2
Mol. Mass.147.002
SMILESClc1ccc(Cl)cc1