Reaction Details
TargetSomatostatin receptor type 4
LigandBDBM50159444
Substrate/Competitorn/a
Meas. Tech.ChEMBL_306614 (CHEMBL829074)
IC50 1.4±n/a nM
Citation Rivier, JEKirby, DAErchegyi, JWaser, BEltschinger, VCescato, RReubi, JC Somatostatin receptor 1 selective analogues: 3. Dicyclic peptides. J Med Chem48:515-22 (2005) 
 
Somatostatin receptor type 4
Name:Somatostatin receptor type 4
Type:Enzyme
Mol. Mass.:42015.38
Organism:Homo sapiens (Human)
Description:P31391
Residue:388
BDBM50159444
NameBDBM50159444
Synonyms:CHEMBL410047 | Des-AA1,2,4,13-[D-Trp8]SRIF
TypeSmall organic molecule
Emp. Form.C62H79N13O14S2
Mol. Mass.1294.499
SMILESC[C@@H](O)[C@H]1NC(=O)[C@H](Cc2ccccc2)NC(=O)[C@H](NC(=O)[C@H](CCCCN)NC(=O)[C@H](Cc2c[nH]c3ccccc23)NC(=O)[C@H](Cc2ccccc2)NC(=O)[C@@H](Cc2ccccc2)NC(=O)[C@H](CC(N)=O)NC(=O)[C@H](N)CSSC[C@H](NC1=O)C(O)=O)[C@@H](C)O