Reaction Details
TargetAmiloride-sensitive amine oxidase [copper-containing]
LigandBDBM50370602
Substrate/Competitorn/a
Meas. Tech.ChEMBL_306517 (CHEMBL828122)
IC50 1000000±n/a nM
Citation Bertini, VBuffoni, FIgnesti, GPicci, NTrombino, SIemma, FAlfei, SPocci, MLucchesini, FDe Munno, A Alkylamino derivatives of 4-aminomethylpyridine as inhibitors of copper-containing amine oxidases. J Med Chem48:664-70 (2005) 
 
Amiloride-sensitive amine oxidase [copper-containing]
Name:Amiloride-sensitive amine oxidase [copper-containing]
Type:Protein
Mol. Mass.:85387.64
Organism:Homo sapiens (Human)
Description:P19801
Residue:751
BDBM50370602
NameBDBM50370602
Synonyms:CHEMBL538353
TypeSmall organic molecule
Emp. Form.C10H16N2S2
Mol. Mass.228.377
SMILESCCSc1cncc(SCC)c1CN