Reaction Details
TargetMembrane primary amine oxidase
LigandBDBM50161148
Substrate/Competitorn/a
Meas. Tech.ChEMBL_306569 (CHEMBL832086)
IC50 56000±n/a nM
Citation Bertini, VBuffoni, FIgnesti, GPicci, NTrombino, SIemma, FAlfei, SPocci, MLucchesini, FDe Munno, A Alkylamino derivatives of 4-aminomethylpyridine as inhibitors of copper-containing amine oxidases. J Med Chem48:664-70 (2005) 
 
Membrane primary amine oxidase
Name:Membrane primary amine oxidase
Type:Protein
Mol. Mass.:84620.86
Organism:Homo sapiens (Human)
Description:Q16853
Residue:763
BDBM50161148
NameBDBM50161148
Synonyms:4-(aminomethyl)-N-cyclohexylpyridin-3-amine dihydrochloride hydrate | CHEMBL557160
TypeSmall organic molecule
Emp. Form.C12H19N3
Mol. Mass.205.2994
SMILESNCc1ccncc1NC1CCCCC1