Reaction Details
TargetPeroxisomal primary amine oxidase
LigandBDBM50161148
Substrate/Competitorn/a
Meas. Tech.ChEMBL_306687 (CHEMBL830021)
IC50>1000000±n/a nM
Citation Bertini, VBuffoni, FIgnesti, GPicci, NTrombino, SIemma, FAlfei, SPocci, MLucchesini, FDe Munno, A Alkylamino derivatives of 4-aminomethylpyridine as inhibitors of copper-containing amine oxidases. J Med Chem48:664-70 (2005) 
 
Peroxisomal primary amine oxidase
Name:Peroxisomal primary amine oxidase
Type:PROTEIN
Mol. Mass.:77535.84
Organism:Pichia angusta
Description:ChEMBL_306687
Residue:692
BDBM50161148
NameBDBM50161148
Synonyms:4-(aminomethyl)-N-cyclohexylpyridin-3-amine dihydrochloride hydrate | CHEMBL557160
TypeSmall organic molecule
Emp. Form.C12H19N3
Mol. Mass.205.2994
SMILESNCc1ccncc1NC1CCCCC1