Reaction Details
TargetAmine oxidase [flavin-containing] A
LigandBDBM50161148
Substrate/Competitorn/a
Meas. Tech.ChEMBL_306631 (CHEMBL829933)
IC50>100000±n/a nM
Citation Bertini, VBuffoni, FIgnesti, GPicci, NTrombino, SIemma, FAlfei, SPocci, MLucchesini, FDe Munno, A Alkylamino derivatives of 4-aminomethylpyridine as inhibitors of copper-containing amine oxidases. J Med Chem48:664-70 (2005) 
 
Amine oxidase [flavin-containing] A
Name:Amine oxidase [flavin-containing] A
Type:Enzyme
Mol. Mass.:59515.21
Organism:Rattus norvegicus (rat)
Description:n/a
Residue:526
BDBM50161148
NameBDBM50161148
Synonyms:4-(aminomethyl)-N-cyclohexylpyridin-3-amine dihydrochloride hydrate | CHEMBL557160
TypeSmall organic molecule
Emp. Form.C12H19N3
Mol. Mass.205.2994
SMILESNCc1ccncc1NC1CCCCC1