Reaction Details
TargetAmine oxidase [flavin-containing] A
LigandBDBM50161153
Substrate/Competitorn/a
Meas. Tech.ChEMBL_306631 (CHEMBL829933)
IC50 170000±n/a nM
Citation Bertini, VBuffoni, FIgnesti, GPicci, NTrombino, SIemma, FAlfei, SPocci, MLucchesini, FDe Munno, A Alkylamino derivatives of 4-aminomethylpyridine as inhibitors of copper-containing amine oxidases. J Med Chem48:664-70 (2005) 
 
Amine oxidase [flavin-containing] A
Name:Amine oxidase [flavin-containing] A
Type:Enzyme
Mol. Mass.:59515.21
Organism:Rattus norvegicus (rat)
Description:n/a
Residue:526
BDBM50161153
NameBDBM50161153
Synonyms:4-(aminomethyl)-N-methyl-5-(methyl-lambda~5~-azanyl)pyridin-3-amine dihydrochloride | CHEMBL537845
TypeSmall organic molecule
Emp. Form.C8H14N4
Mol. Mass.166.2236
SMILESCNc1cncc(NC)c1CN