Reaction Details
TargetAmine oxidase [flavin-containing] B
LigandBDBM50161153
Substrate/Competitorn/a
Meas. Tech.ChEMBL_306661 (CHEMBL831434)
IC50>170000±n/a nM
Citation Bertini, VBuffoni, FIgnesti, GPicci, NTrombino, SIemma, FAlfei, SPocci, MLucchesini, FDe Munno, A Alkylamino derivatives of 4-aminomethylpyridine as inhibitors of copper-containing amine oxidases. J Med Chem48:664-70 (2005) 
 
Amine oxidase [flavin-containing] B
Name:Amine oxidase [flavin-containing] B
Type:Enzyme
Mol. Mass.:58469.65
Organism:Rattus norvegicus (rat)
Description:P19643
Residue:520
BDBM50161153
NameBDBM50161153
Synonyms:4-(aminomethyl)-N-methyl-5-(methyl-lambda~5~-azanyl)pyridin-3-amine dihydrochloride | CHEMBL537845
TypeSmall organic molecule
Emp. Form.C8H14N4
Mol. Mass.166.2236
SMILESCNc1cncc(NC)c1CN