Reaction Details
TargetMembrane primary amine oxidase
LigandBDBM50161153
Substrate/Competitorn/a
Meas. Tech.ChEMBL_306569 (CHEMBL832086)
IC50 1700±n/a nM
Citation Bertini, VBuffoni, FIgnesti, GPicci, NTrombino, SIemma, FAlfei, SPocci, MLucchesini, FDe Munno, A Alkylamino derivatives of 4-aminomethylpyridine as inhibitors of copper-containing amine oxidases. J Med Chem48:664-70 (2005) 
 
Membrane primary amine oxidase
Name:Membrane primary amine oxidase
Type:Protein
Mol. Mass.:84620.86
Organism:Homo sapiens (Human)
Description:Q16853
Residue:763
BDBM50161153
NameBDBM50161153
Synonyms:4-(aminomethyl)-N-methyl-5-(methyl-lambda~5~-azanyl)pyridin-3-amine dihydrochloride | CHEMBL537845
TypeSmall organic molecule
Emp. Form.C8H14N4
Mol. Mass.166.2236
SMILESCNc1cncc(NC)c1CN