Reaction Details
TargetReceptor tyrosine-protein kinase erbB-2
LigandBDBM50161915
Substrate/Competitorn/a
Meas. Tech.ChEMBL_313008 (CHEMBL874202)
IC50 44±n/a nM
Citation Tsou, HROverbeek-Klumpers, EGHallett, WAReich, MFFloyd, MBJohnson, BDMichalak, RSNilakantan, RDiscafani, CGolas, JRabindran, SKShen, RShi, XWang, YFUpeslacis, JWissner, A Optimization of 6,7-disubstituted-4-(arylamino)quinoline-3-carbonitriles as orally active, irreversible inhibitors of human epidermal growth factor receptor-2 kinase activity. J Med Chem48:1107-31 (2005) 
 
Receptor tyrosine-protein kinase erbB-2
Name:Receptor tyrosine-protein kinase erbB-2
Type:n/a
Mol. Mass.:137894.47
Organism:Homo sapiens (Human)
Description:P04626
Residue:1255
BDBM50161915
NameBDBM50161915
Synonyms:4-Dimethylamino-but-2-enoic acid {4-[3-chloro-4-(2-methoxy-benzyloxy)-phenylamino]-3-cyano-7-ethoxy-quinolin-6-yl}-amide | CHEMBL362232
TypeSmall organic molecule
Emp. Form.C32H32ClN5O4
Mol. Mass.586.081
SMILESCCOc1cc2ncc(C#N)c(Nc3ccc(OCc4ccccc4OC)c(Cl)c3)c2cc1NC(=O)\C=C\CN(C)C