Reaction Details
TargetEpidermal growth factor receptor
LigandBDBM50161939
Substrate/Competitorn/a
Meas. Tech.ChEMBL_312997 (CHEMBL873338)
IC50 64±n/a nM
Citation Tsou, HROverbeek-Klumpers, EGHallett, WAReich, MFFloyd, MBJohnson, BDMichalak, RSNilakantan, RDiscafani, CGolas, JRabindran, SKShen, RShi, XWang, YFUpeslacis, JWissner, A Optimization of 6,7-disubstituted-4-(arylamino)quinoline-3-carbonitriles as orally active, irreversible inhibitors of human epidermal growth factor receptor-2 kinase activity. J Med Chem48:1107-31 (2005) 
 
Epidermal growth factor receptor
Name:Epidermal growth factor receptor
Type:Receptor Kinase Domain
Mol. Mass.:134279.59
Organism:Homo sapiens (Human)
Description:P00533
Residue:1210
BDBM50161939
NameBDBM50161939
Synonyms:4-Dimethylamino-but-2-enoic acid {4-[3-chloro-4-(4-fluoro-benzyloxy)-phenylamino]-3-cyano-7-ethoxy-quinolin-6-yl}-amide | CHEMBL180516
TypeSmall organic molecule
Emp. Form.C31H29ClFN5O3
Mol. Mass.574.045
SMILESCCOc1cc2ncc(C#N)c(Nc3ccc(OCc4ccc(F)cc4)c(Cl)c3)c2cc1NC(=O)\C=C\CN(C)C