Reaction Details
TargetReceptor tyrosine-protein kinase erbB-2
LigandBDBM50161934
Substrate/Competitorn/a
Meas. Tech.ChEMBL_313008 (CHEMBL874202)
IC50 58±n/a nM
Citation Tsou, HROverbeek-Klumpers, EGHallett, WAReich, MFFloyd, MBJohnson, BDMichalak, RSNilakantan, RDiscafani, CGolas, JRabindran, SKShen, RShi, XWang, YFUpeslacis, JWissner, A Optimization of 6,7-disubstituted-4-(arylamino)quinoline-3-carbonitriles as orally active, irreversible inhibitors of human epidermal growth factor receptor-2 kinase activity. J Med Chem48:1107-31 (2005) 
 
Receptor tyrosine-protein kinase erbB-2
Name:Receptor tyrosine-protein kinase erbB-2
Type:n/a
Mol. Mass.:137894.47
Organism:Homo sapiens (Human)
Description:P04626
Residue:1255
BDBM50161934
NameBDBM50161934
Synonyms:4-(4,4-Dihydroxy-piperidin-1-yl)-but-2-enoic acid [4-(4-benzyloxy-3-chloro-phenylamino)-3-cyano-7-ethoxy-quinolin-6-yl]-amide | CHEMBL362824
TypeSmall organic molecule
Emp. Form.C34H34ClN5O5
Mol. Mass.628.117
SMILESCCOc1cc2ncc(C#N)c(Nc3ccc(OCc4ccccc4)c(Cl)c3)c2cc1NC(=O)\C=C\CN1CCC(O)(O)CC1