Reaction Details
TargetNeuronal acetylcholine receptor subunit alpha-4/beta-2
LigandBDBM50162061
Substrate/Competitorn/a
Meas. Tech.ChEMBL_303546 (CHEMBL839751)
Ki 0.02±n/a nM
Citation Carroll, FIMa, WYokota, YLee, JRBrieaddy, LENavarro, HADamaj, MIMartin, BR Synthesis, nicotinic acetylcholine receptor binding, and antinociceptive properties of 3'-substituted deschloroepibatidine analogues. Novel nicotinic antagonists. J Med Chem48:1221-8 (2005) 
 
Neuronal acetylcholine receptor subunit alpha-4/beta-2
Name:Neuronal acetylcholine receptor subunit alpha-4/beta-2
Type:n/a
Mol. Mass.:n/a
Description:n/a
Components:This complex has 0 components.
Component 1
Name:Neuronal acetylcholine receptor subunit alpha-4
Synonyms:ACHA4_RAT Cholinergic, Nicotinic Alpha4Beta2 Chrna4 Neuronal acetylcholine receptor (alpha4beta2 nAChR) Neuronal acetylcholine receptor subunit alpha 4 beta 2 | Neuronal acetylcholine receptor subunit alpha-4
Type:Enzyme
Mol. Mass.:70196.44
Organism:Rattus norvegicus (Rat)
Description:P09483
Residue:630
Component 2
Name:Neuronal acetylcholine receptor subunit beta-2
Synonyms:ACHB2_RAT Chrnb2 Neuronal acetylcholine receptor non-alpha-1 chain
Type:Enzyme
Mol. Mass.:56910.32
Organism:Rattus norvegicus (Rat)
Description:P12390
Residue:500
BDBM50162061
NameBDBM50162061
Synonyms:2-(5-Ethynyl-pyridin-3-yl)-7-aza-bicyclo[2.2.1]heptane | CHEMBL178606
TypeSmall organic molecule
Emp. Form.C13H14N2
Mol. Mass.198.2637
SMILESC#Cc1cncc(c1)C1CC2CCC1N2