Reaction Details
Target5-hydroxytryptamine receptor 3A/3B
LigandBDBM50161753
Substrate/Competitorn/a
Meas. Tech.ChEMBL_303145 (CHEMBL829119)
Ki 1662±n/a nM
Citation Bodnar, ALCortes-Burgos, LACook, KKDinh, DMGroppi, VEHajos, MHigdon, NRHoffmann, WEHurst, RSMyers, JKRogers, BNWall, TMWolfe, MLWong, E Discovery and structure-activity relationship of quinuclidine benzamides as agonists of alpha7 nicotinic acetylcholine receptors. J Med Chem48:905-8 (2005) 
 
5-hydroxytryptamine receptor 3A/3B
Name:5-hydroxytryptamine receptor 3A/3B
Type:n/a
Mol. Mass.:n/a
Description:ASSAY_ID of EBI is 2974
Components:This complex has 2 components.
Component 1
Name:5-hydroxytryptamine receptor 3B
Synonyms:5HT3B_RAT Serotonin (5-HT) receptor
Type:PROTEIN
Mol. Mass.:50328.78
Organism:Rattus norvegicus
Description:EBI_11885
Residue:437
Component 2
Name:5-hydroxytryptamine receptor 3A
Synonyms:5-HT3 5HT3A_RAT Htr3 Serotonin (5-HT) receptor | Zacopride site-R
Type:Enzyme Catalytic Domain
Mol. Mass.:55428.70
Organism:RAT
Description:5-HT3 HTR3A RAT::P35563
Residue:483
BDBM50161753
NameBDBM50161753
Synonyms:CHEMBL554984 | N-[(3R)-1-azabicyclo[2.2.2]oct-3-yl]-4-chlorobenzamide; compound with hydrochloride
TypeSmall organic molecule
Emp. Form.C14H17ClN2O
Mol. Mass.264.751
SMILESClc1ccc(cc1)C(=O)N[C@H]1CN2CCC1CC2