Reaction Details
TargetSodium-dependent dopamine transporter
LigandBDBM50050098
Substrate/Competitorn/a
Meas. Tech.ChEMBL_306238 (CHEMBL830335)
IC50 121.7±n/a nM
Citation Patrick, KSWilliard, RLVanWert, ALDowd, JJOatis, JEMiddaugh, LD Synthesis and pharmacology of ethylphenidate enantiomers: the human transesterification metabolite of methylphenidate and ethanol. J Med Chem48:2876-81 (2005) 
 
Sodium-dependent dopamine transporter
Name:Sodium-dependent dopamine transporter
Type:Multi-pass membrane protein
Mol. Mass.:68497.11
Organism:Homo sapiens (Human)
Description:Q01959
Residue:620
BDBM50050098
NameBDBM50050098
Synonyms:(S)-Phenyl-(S)-piperidin-2-yl-acetic acid methyl ester; hydrochloride METHYLPHENIDATE
TypeSmall organic molecule
Emp. Form.C14H19NO2
Mol. Mass.233.3062
SMILESCOC(=O)[C@H]([C@@H]1CCCCN1)c1ccccc1