Reaction Details
TargetMelanocyte-stimulating hormone receptor
LigandBDBM50166122
Substrate/Competitorn/a
Meas. Tech.ChEMBL_304145 (CHEMBL840261)
EC50 0.830±n/a nM
Citation Todorovic, AHolder, JRBauzo, RMScott, JWKavanagh, RAbdel-Malek, ZHaskell-Luevano, C N-terminal fatty acylated His-dPhe-Arg-Trp-NH(2) tetrapeptides: influence of fatty acid chain length on potency and selectivity at the mouse melanocortin receptors and human melanocytes. J Med Chem48:3328-36 (2005) 
 
Melanocyte-stimulating hormone receptor
Name:Melanocyte-stimulating hormone receptor
Type:PROTEIN
Mol. Mass.:35238.60
Organism:Mus musculus
Description:ChEMBL_1498846
Residue:315
BDBM50166122
NameBDBM50166122
Synonyms:(S)-5-Guanidino-2-{(R)-2-[(S)-3-(3H-imidazol-4-yl)-2-octadecylamino-propionylamino]-3-phenyl-propionylamino}-pentanoic acid [(S)-1-carbamoyl-2-(1H-indol-3-yl)-ethyl]-amide | CHEMBL364726
TypeSmall organic molecule
Emp. Form.C50H77N11O4
Mol. Mass.896.2177
[C@@H](Cc1cnc[nH]1)C(=O)N[C@H](Cc1ccccc1)C(=O)N[C@@H](CCCNC(N)=N)C(=O)N[C@@H](Cc1c[nH]c2ccccc12)C(N)=O