Reaction Details
TargetMelanocortin receptor 5
LigandBDBM50166127
Substrate/Competitorn/a
Meas. Tech.ChEMBL_304148 (CHEMBL828129)
EC50 10±n/a nM
Citation Todorovic, AHolder, JRBauzo, RMScott, JWKavanagh, RAbdel-Malek, ZHaskell-Luevano, C N-terminal fatty acylated His-dPhe-Arg-Trp-NH(2) tetrapeptides: influence of fatty acid chain length on potency and selectivity at the mouse melanocortin receptors and human melanocytes. J Med Chem48:3328-36 (2005) 
 
Melanocortin receptor 5
Name:Melanocortin receptor 5
Type:Enzyme
Mol. Mass.:36966.58
Organism:Mus musculus (Mouse)
Description:P41149
Residue:325
BDBM50166127
NameBDBM50166127
Synonyms:CHEMBL194217 | Undecanoic acid [(S)-1-((R)-1-{(S)-1-[(S)-1-carbamoyl-2-(1H-indol-3-yl)-ethylcarbamoyl]-4-guanidino-butylcarbamoyl}-2-phenyl-ethylcarbamoyl)-2-(3H-imidazol-4-yl)-ethyl]-amide
TypeSmall organic molecule
Emp. Form.C43H61N11O5
Mol. Mass.812.0151
SMILESCCCCCCCCCCC(=O)N[C@@H](Cc1cnc[nH]1)C(=O)N[C@H](Cc1ccccc1)C(=O)N[C@@H](CCCNC(N)=N)C(=O)N[C@@H](Cc1c[nH]c2ccccc12)C(N)=O