Reaction Details
TargetSodium-dependent serotonin transporter
LigandBDBM50166145
Substrate/Competitorn/a
Meas. Tech.ChEMBL_305838 (CHEMBL829579)
IC50 280±n/a nM
Citation Simoni, DRossi, MBertolasi, VRoberti, MPizzirani, DRondanin, RBaruchello, RInvidiata, FPTolomeo, MGrimaudo, SMerighi, SVarani, KGessi, SBorea, PAMarino, SCavallini, SBianchi, CSiniscalchi, A Synthesis and pharmacology of 6-substituted benztropines: discovery of novel dopamine uptake inhibitors possessing low binding affinity to the dopamine transporter. J Med Chem48:3337-43 (2005) 
 
Sodium-dependent serotonin transporter
Name:Sodium-dependent serotonin transporter
Type:Multi-pass membrane protein
Mol. Mass.:70168.43
Organism:Rattus norvegicus (rat)
Description:P31652
Residue:630
BDBM50166145
NameBDBM50166145
Synonyms:(3S,6R)-3-[Bis-(4-fluoro-phenyl)-methoxy]-6-methoxy-8-methyl-8-aza-bicyclo[3.2.1]octane | CHEMBL425907
TypeSmall organic molecule
Emp. Form.C22H25F2NO2
Mol. Mass.373.4362
SMILESCO[C@@H]1CC2C[C@@H](CC1N2C)OC(c1ccc(F)cc1)c1ccc(F)cc1