Reaction Details
TargetHistone deacetylase 2b
LigandBDBM50422364
Substrate/Competitorn/a
Meas. Tech.ChEMBL_305568 (CHEMBL827162)
IC50 10.0±n/a nM
Citation Mai, AMassa, SPezzi, RSimeoni, SRotili, DNebbioso, AScognamiglio, AAltucci, LLoidl, PBrosch, G Class II (IIa)-selective histone deacetylase inhibitors. 1. Synthesis and biological evaluation of novel (aryloxopropenyl)pyrrolyl hydroxyamides. J Med Chem48:3344-53 (2005) 
 
Histone deacetylase 2b
Name:Histone deacetylase 2b
Synonyms:Histone deacetylase HD2
Type:PROTEIN
Mol. Mass.:30785.07
Organism:Zea mays
Description:ChEMBL_87549
Residue:286
BDBM50422364
NameBDBM50422364
Synonyms:TRAPOXIN B
TypeSmall organic molecule
Emp. Form.C33H40N4O6
Mol. Mass.588.6939
SMILESO=C(CCCCC[C@@H]1NC(=O)[C@H]2CCCN2C(=O)[C@H](Cc2ccccc2)NC(=O)[C@H](Cc2ccccc2)NC1=O)[C@@H]1CO1