Reaction Details
TargetProgesterone receptor
LigandBDBM50172022
Substrate/Competitorn/a
Meas. Tech.ChEMBL_321436 (CHEMBL880244)
IC50 22±n/a nM
Citation Betageri, RZhang, YZindell, RMKuzmich, DKirrane, TMBentzien, JCardozo, MCapolino, AJFadra, TNNelson, RMPaw, ZShih, DTShih, CKZuvela-Jelaska, LNabozny, GThomson, DS Trifluoromethyl group as a pharmacophore: effect of replacing a CF3 group on binding and agonist activity of a glucocorticoid receptor ligand. Bioorg Med Chem Lett15:4761-9 (2005) 
 
Progesterone receptor
Name:Progesterone receptor
Type:Protein
Mol. Mass.:98979.52
Organism:Homo sapiens (Human)
Description:P06401
Residue:933
BDBM50172022
NameBDBM50172022
Synonyms:4-(5-Fluoro-2-hydroxy-phenyl)-2-hydroxy-4-methyl-2-trifluoromethyl-pentanoic acid (4-methyl-1-oxo-1H-benzo[d][1,2]oxazin-6-yl)-amide | CHEMBL196374
TypeSmall organic molecule
Emp. Form.C22H20F4N2O5
Mol. Mass.468.3982
SMILESCc1noc(=O)c2ccc(NC(=O)C(O)(CC(C)(C)c3cc(F)ccc3O)C(F)(F)F)cc12