Reaction Details
TargetGlucocorticoid receptor
LigandBDBM50172022
Substrate/Competitorn/a
Meas. Tech.ChEMBL_322141 (CHEMBL883715)
EC50 10±n/a nM
Citation Betageri, RZhang, YZindell, RMKuzmich, DKirrane, TMBentzien, JCardozo, MCapolino, AJFadra, TNNelson, RMPaw, ZShih, DTShih, CKZuvela-Jelaska, LNabozny, GThomson, DS Trifluoromethyl group as a pharmacophore: effect of replacing a CF3 group on binding and agonist activity of a glucocorticoid receptor ligand. Bioorg Med Chem Lett15:4761-9 (2005) 
 
Glucocorticoid receptor
Name:Glucocorticoid receptor
Type:Enzyme
Mol. Mass.:85656.87
Organism:Homo sapiens (Human)
Description:P04150
Residue:777
BDBM50172022
NameBDBM50172022
Synonyms:4-(5-Fluoro-2-hydroxy-phenyl)-2-hydroxy-4-methyl-2-trifluoromethyl-pentanoic acid (4-methyl-1-oxo-1H-benzo[d][1,2]oxazin-6-yl)-amide | CHEMBL196374
TypeSmall organic molecule
Emp. Form.C22H20F4N2O5
Mol. Mass.468.3982
SMILESCc1noc(=O)c2ccc(NC(=O)C(O)(CC(C)(C)c3cc(F)ccc3O)C(F)(F)F)cc12