Reaction Details
TargetGlucocorticoid receptor
LigandBDBM50172021
Substrate/Competitorn/a
Meas. Tech.ChEMBL_321442 (CHEMBL880250)
IC50 6±n/a nM
Citation Betageri, RZhang, YZindell, RMKuzmich, DKirrane, TMBentzien, JCardozo, MCapolino, AJFadra, TNNelson, RMPaw, ZShih, DTShih, CKZuvela-Jelaska, LNabozny, GThomson, DS Trifluoromethyl group as a pharmacophore: effect of replacing a CF3 group on binding and agonist activity of a glucocorticoid receptor ligand. Bioorg Med Chem Lett15:4761-9 (2005) 
 
Glucocorticoid receptor
Name:Glucocorticoid receptor
Type:Enzyme
Mol. Mass.:85656.87
Organism:Homo sapiens (Human)
Description:P04150
Residue:777
BDBM50172021
NameBDBM50172021
Synonyms:4-(5-Fluoro-2-hydroxy-phenyl)-2-hydroxy-4-methyl-2-trifluoromethyl-pentanoic acid (1-oxo-1,3-dihydro-isobenzofuran-5-yl)-amide | CHEMBL194745
TypeSmall organic molecule
Emp. Form.C21H19F4NO5
Mol. Mass.441.3729
SMILESCC(C)(CC(O)(C(=O)Nc1ccc2C(=O)OCc2c1)C(F)(F)F)c1cc(F)ccc1O