Reaction Details
TargetGlycogen phosphorylase, muscle form
LigandBDBM50172969
Substrate/Competitorn/a
Meas. Tech.ChEMBL_321381 (CHEMBL881759)
IC50 110±n/a nM
Citation Dudash, JZhang, YMoore, JBLook, RLiang, YBeavers, MPConway, BRRybczynski, PJDemarest, KT Synthesis and evaluation of 3-anilino-quinoxalinones as glycogen phosphorylase inhibitors. Bioorg Med Chem Lett15:4790-3 (2005) 
 
Glycogen phosphorylase, muscle form
Name:Glycogen phosphorylase, muscle form
Type:PROTEIN
Mol. Mass.:97097.45
Organism:Homo sapiens (Human)
Description:ChEMBL_1449751
Residue:842
BDBM50172969
NameBDBM50172969
Synonyms:4-(4-Methyl-3-oxo-3,4-dihydro-quinoxalin-2-ylamino)-N-thiophen-2-ylmethyl-benzamide | CHEMBL194356
TypeSmall organic molecule
Emp. Form.C21H18N4O2S
Mol. Mass.390.458
SMILESCn1c2ccccc2nc(Nc2ccc(cc2)C(=O)NCc2cccs2)c1=O