Reaction Details
TargetGlycogen phosphorylase, muscle form
LigandBDBM50172983
Substrate/Competitorn/a
Meas. Tech.ChEMBL_321381 (CHEMBL881759)
IC50 140±n/a nM
Citation Dudash, JZhang, YMoore, JBLook, RLiang, YBeavers, MPConway, BRRybczynski, PJDemarest, KT Synthesis and evaluation of 3-anilino-quinoxalinones as glycogen phosphorylase inhibitors. Bioorg Med Chem Lett15:4790-3 (2005) 
 
Glycogen phosphorylase, muscle form
Name:Glycogen phosphorylase, muscle form
Type:PROTEIN
Mol. Mass.:97097.45
Organism:Homo sapiens (Human)
Description:ChEMBL_1449751
Residue:842
BDBM50172983
NameBDBM50172983
Synonyms:4-(7-Fluoro-4-methyl-3-oxo-3,4-dihydro-quinoxalin-2-ylamino)-N-thiophen-2-ylmethyl-benzamide | CHEMBL193734
TypeSmall organic molecule
Emp. Form.C21H17FN4O2S
Mol. Mass.408.449
SMILESCn1c2ccc(F)cc2nc(Nc2ccc(cc2)C(=O)NCc2cccs2)c1=O