Reaction Details
TargetCannabinoid receptor 1
LigandBDBM50172905
Substrate/Competitorn/a
Meas. Tech.ChEMBL_320879 (CHEMBL884804)
Ki 141±n/a nM
Citation Lange, JHvan Stuivenberg, HHVeerman, WWals, HCStork, BCoolen, HKMcCreary, ACAdolfs, TJKruse, CG Novel 3,4-diarylpyrazolines as potent cannabinoid CB1 receptor antagonists with lower lipophilicity. Bioorg Med Chem Lett15:4794-8 (2005) 
 
Cannabinoid receptor 1
Name:Cannabinoid receptor 1
Type:G Protein-Coupled Receptor (GPCR)
Mol. Mass.:52868.96
Organism:Homo sapiens (Human)
Description:P21554
Residue:472
BDBM50172905
NameBDBM50172905
Synonyms:3,4-diarylpyrazoline derivative | CHEMBL196048
TypeSmall organic molecule
Emp. Form.C20H25ClN6O2S
Mol. Mass.448.97
SMILESCCN(CC)S(=O)(=O)NC(=NC)N1CC(C(=N1)c1ccc(Cl)cc1)c1cccnc1