Reaction Details
TargetCannabinoid receptor 2
LigandBDBM50172899
Substrate/Competitorn/a
Meas. Tech.ChEMBL_320878 (CHEMBL884803)
Ki 3270±n/a nM
Citation Lange, JHvan Stuivenberg, HHVeerman, WWals, HCStork, BCoolen, HKMcCreary, ACAdolfs, TJKruse, CG Novel 3,4-diarylpyrazolines as potent cannabinoid CB1 receptor antagonists with lower lipophilicity. Bioorg Med Chem Lett15:4794-8 (2005) 
 
Cannabinoid receptor 2
Name:Cannabinoid receptor 2
Type:G Protein-Coupled Receptor (GPCR)
Mol. Mass.:39690.94
Organism:Homo sapiens (Human)
Description:P34972
Residue:360
BDBM50172899
NameBDBM50172899
Synonyms:3,4-diarylpyrazoline derivative | CHEMBL195050
TypeSmall organic molecule
Emp. Form.C21H26ClN5O2S
Mol. Mass.447.981
SMILESCCN(CC)S(=O)(=O)NC(=NC)N1CC(C(=N1)c1ccc(Cl)cc1)c1ccccc1