Reaction Details
TargetCannabinoid receptor 1
LigandBDBM50172898
Substrate/Competitorn/a
Meas. Tech.ChEMBL_320879 (CHEMBL884804)
Ki 152±n/a nM
Citation Lange, JHvan Stuivenberg, HHVeerman, WWals, HCStork, BCoolen, HKMcCreary, ACAdolfs, TJKruse, CG Novel 3,4-diarylpyrazolines as potent cannabinoid CB1 receptor antagonists with lower lipophilicity. Bioorg Med Chem Lett15:4794-8 (2005) 
 
Cannabinoid receptor 1
Name:Cannabinoid receptor 1
Type:G Protein-Coupled Receptor (GPCR)
Mol. Mass.:52868.96
Organism:Homo sapiens (Human)
Description:P21554
Residue:472
BDBM50172898
NameBDBM50172898
Synonyms:3,4-diarylpyrazoline derivative CHEMBL195958
TypeSmall organic molecule
Emp. Form.C22H26ClN5O2S
Mol. Mass.459.992
SMILESCN=C(NS(=O)(=O)N1CCCCC1)N1CC(C(=N1)c1ccc(Cl)cc1)c1ccccc1