Reaction Details
TargetProtein-S-isoprenylcysteine O-methyltransferase
LigandBDBM50174223
Substrate/Competitorn/a
Meas. Tech.ChEMBL_321447 (CHEMBL880255)
IC50 2400±n/a nM
Citation Henriksen, BSAnderson, JLHrycyna, CAGibbs, RA Synthesis of desthio prenylcysteine analogs: sulfur is important for biological activity. Bioorg Med Chem Lett15:5080-3 (2005) 
 
Protein-S-isoprenylcysteine O-methyltransferase
Name:Protein-S-isoprenylcysteine O-methyltransferase
Type:PROTEIN
Mol. Mass.:27893.87
Organism:Saccharomyces cerevisiae
Description:ChEMBL_321482
Residue:239
BDBM50174223
NameBDBM50174223
Synonyms:2-(3-Octyl-6-phenyl-indol-1-yl)-acetamide | CHEMBL198274
TypeSmall organic molecule
Emp. Form.C24H30N2O
Mol. Mass.362.5078
SMILESCCCCCCCCc1cn(CC(N)=O)c2cc(ccc12)-c1ccccc1